Content-type: text/xml

<?xml version="1.0" encoding="utf-8"?>
<testing-report run-id="572493" judge-id="1756" status="CE" scoring="KIROV" run-tests="0" contest-id="2089" compile-error="yes" tests-passed="0" score="0" max-score="0" >
  <uuid>0711a7d1-9380-446b-989c-c744d696df75</uuid>
  <compiler_output>572493.cs(28,17): error CS1525: Unexpected symbol `&amp;&amp;'
572493.cs(28,20): warning CS0642: Possible mistaken empty statement
572493.cs(29,4): error CS1525: Unexpected symbol `{'
572493.cs(35,12): error CS1525: Unexpected symbol `&amp;&amp;'
572493.cs(35,15): warning CS0642: Possible mistaken empty statement
572493.cs(36,4): error CS1525: Unexpected symbol `{'
572493.cs(41,4): error CS1525: Unexpected symbol `else'
572493.cs(41,17): error CS1525: Unexpected symbol `&amp;&amp;'
572493.cs(41,20): warning CS0642: Possible mistaken empty statement
572493.cs(42,4): error CS1525: Unexpected symbol `{'
Compilation failed: 7 error(s), 3 warnings
</compiler_output>
</testing-report>
